Target
Intestinal-type alkaline phosphatase
Ligand
BDBM50165144
Substrate
Meas. Tech.
ChEMBL_1572749 (CHEMBL3804258)
Ki
7660±n/a nM
Citation
 al-Rashida, MBatool, GSattar, AEjaz, SAKhan, SLecka, JSévigny, JHameed, AIqbal, J 2-Alkoxy-3-(sulfonylarylaminomethylene)-chroman-4-ones as potent and selective inhibitors of ectonucleotidases. Eur J Med Chem 115:484-94 (2016)  
Target
Name:
Intestinal-type alkaline phosphatase
Synonyms:
ALPI Intestinal alkaline phosphatase (IAP) PPBI_BOVIN
Type:
Protein
Mol. Mass.:
57094.82
Organism:
Bos taurus (Cattle)
Description:
P19111
Residue:
533
  
Inhibitor
Name:
BDBM50165144
Synonyms:
CHEMBL3798753
Type:
Small organic molecule
Emp. Form.:
C19H20N2O5S
Mol. Mass.:
388.438
SMILES:
CC(C)OC1Oc2ccccc2C(=O)\C1=C/Nc1cccc(c1)S(N)(=O)=O
: