Target
P2Y purinoceptor 12
Ligand
BDBM50366480
Substrate
Meas. Tech.
ChEMBL_1573761 (CHEMBL3802945)
IC50
251189±n/a nM
Citation
 Zetterberg, FSvensson, P State of affairs: Design and structure-activity relationships of reversible P2Y12 receptor antagonists. Bioorg Med Chem Lett 26:2739-2754 (2016)  
Target
Name:
P2Y purinoceptor 12
Synonyms:
ADP-glucose receptor HORK3 P2T(AC) P2Y(AC) P2Y(cyc) P2Y12 platelet ADP receptor Purinergic receptor P2Y12 | SP1999
Type:
Enzyme
Mol. Mass.:
39458.48
Organism:
Homo sapiens (Human)
Description:
Q9H244
Residue:
342
  
Inhibitor
Name:
BDBM50366480
Synonyms:
ADENOSINE TRIPHOSPHATE | ATP
Type:
Small organic molecule
Emp. Form.:
C10H16N5O13P3
Mol. Mass.:
507.181
SMILES:
Nc1ncnc2n(cnc12)[C@@H]1O[C@H](CO[P@](O)(=O)O[P@@](O)(=O)OP(O)(O)=O)[C@@H](O)[C@H]1O
: