Target
Carbonic anhydrase 12
Ligand
BDBM50171191
Substrate
Meas. Tech.
ChEMBL_1576951 (CHEMBL3806794)
Ki
0.540000±n/a nM
Citation
 Chandak, NCeruso, MSupuran, CTSharma, PK Novel sulfonamide bearing coumarin scaffolds as selective inhibitors of tumor associated carbonic anhydrase isoforms IX and XII. Bioorg Med Chem 24:2882-2886 (2016)  
Target
Name:
Carbonic anhydrase 12
Synonyms:
CA-XII CAH12_HUMAN Carbonic anhydrase Carbonic anhydrase XII Carbonic anhydrase XII (CAXII) | Tumor antigen HOM-RCC-3.1.3
Type:
Enzyme
Mol. Mass.:
39456.00
Organism:
Homo sapiens (Human)
Description:
Catalytic domain of human cloned isozyme was used in the assay
Residue:
354
  
Inhibitor
Name:
BDBM50171191
Synonyms:
CHEMBL3806054
Type:
Small organic molecule
Emp. Form.:
C28H18ClFN6O4S2
Mol. Mass.:
621.062
SMILES:
NS(=O)(=O)c1ccc(cc1)-n1cc(\C=N/Nc2nc(cs2)-c2cc3cc(Cl)ccc3oc2=O)c(n1)-c1ccc(F)cc1
: