Target
Replicase polyprotein 1ab
Ligand
BDBM50176857
Substrate
Meas. Tech.
ChEMBL_1579098 (CHEMBL3811446)
IC50
11700±n/a nM
Citation
 Kumar, VTan, KPWang, YMLin, SWLiang, PH Identification, synthesis and evaluation of SARS-CoV and MERS-CoV 3C-like protease inhibitors. Bioorg Med Chem 24:3035-3042 (2016)  
Target
Name:
Replicase polyprotein 1ab
Synonyms:
3C-like proteinase 3C-like proteinase (SARS-CoV 3Cpro) 3CLp GFL Guanine-N7 methyltransferase Helicase Leader protein Non-structural protein 10 Non-structural protein 3 Non-structural protein 6 Non-structural protein 8 ORF1ab polyprotein PL2-PRO Pol R1AB_SARS RdRp SARS coronavirus main proteinase nsp1 nsp12 nsp14 nsp16 nsp3 nsp5 nsp7 nsp9 pp1ab | rep
Type:
Protein
Mol. Mass.:
790250.81
Organism:
Human SARS coronavirus (SARS-CoV) (Severe acute respiratory syndrome coronavirus)
Description:
P0C6X7
Residue:
7073
  
Inhibitor
Name:
BDBM50176857
Synonyms:
CHEMBL3809506
Type:
Small organic molecule
Emp. Form.:
C30H24N2O4
Mol. Mass.:
476.5226
SMILES:
CC(C)c1ccc(cc1)N1N=C(\C(=C\c2ccc(o2)-c2ccccc2C(O)=O)C1=O)c1ccccc1
: