Target
Shikimate kinase
Ligand
BDBM50182448
Substrate
Meas. Tech.
ChEMBL_1586646 (CHEMBL3822136)
Ki
560±n/a nM
Citation
 Prado, VLence, EManeiro, MVázquez-Ucha, JCBeceiro, AThompson, PHawkins, ARGonzález-Bello, C Targeting the Motion of Shikimate Kinase: Development of Competitive Inhibitors that Stabilize an Inactive Open Conformation of the Enzyme. J Med Chem 59:5471-87 (2016)  
Target
Name:
Shikimate kinase
Synonyms:
AROK_HELPY aroK
Type:
PROTEIN
Mol. Mass.:
18412.75
Organism:
Helicobacter pylori (strain ATCC 700392 / 26695) (Campylobacterpylori)
Description:
ChEMBL_432674
Residue:
162
  
Inhibitor
Name:
BDBM50182448
Synonyms:
CHEMBL3818824
Type:
Small organic molecule
Emp. Form.:
C16H16O5S
Mol. Mass.:
320.36
SMILES:
O[C@@H]1C=C(C[C@@H](OCc2ccc3sccc3c2)[C@@H]1O)C(O)=O
: