Target
Chromobox protein homolog 7
Ligand
BDBM50189711
Substrate
Meas. Tech.
ChEMBL_1590117 (CHEMBL3829385)
Ki
25000±n/a nM
Citation
 Ren, CSmith, SGYap, KLi, SLi, JMezei, MRodriguez, YVincek, AAguilo, FWalsh, MJZhou, MM Structure-Guided Discovery of Selective Antagonists for the Chromodomain of Polycomb Repressive Protein CBX7. ACS Med Chem Lett 7:601-5 (2016)  
Target
Name:
Chromobox protein homolog 7
Synonyms:
CBX7 Chromobox protein homolog 7 | Chromobox protein homolog 7 (CBX7)
Type:
Protein
Mol. Mass.:
28351.76
Organism:
Homo sapiens (Human)
Description:
Residue:
251
  
Inhibitor
Name:
BDBM50189711
Synonyms:
CHEMBL3827805
Type:
Small organic molecule
Emp. Form.:
C24H31N3O7S
Mol. Mass.:
505.584
SMILES:
CCS(=O)(=O)Nc1ccc(OCC(=O)N2CCN(CC2)C(=O)c2cccc(OC)c2OC)cc1C
: