Target
Cholinesterase
Ligand
BDBM11682
Substrate
Meas. Tech.
ChEMBL_1614945 (CHEMBL3857014)
IC50
1320±n/a nM
Citation
 Kumar, JMeena, PSingh, AJameel, EMaqbool, MMobashir, MShandilya, ATiwari, MHoda, NJayaram, B Synthesis and screening of triazolopyrimidine scaffold as multi-functional agents for Alzheimer's disease therapies. Eur J Med Chem 119:260-77 (2016)  
Target
Name:
Cholinesterase
Synonyms:
BCHE CHLE_HORSE | Cholinesterase
Type:
Enzyme
Mol. Mass.:
65643.35
Organism:
Equus caballus (Horse)
Description:
P81908
Residue:
574
  
Inhibitor
Name:
BDBM11682
Synonyms:
2,3-dihydroxybutanedioic acid; 3-[(1S)-1-(dimethylamino)ethyl]phenyl N-ethyl-N-methylcarbamate US9586925, Rivastigmine
Type:
Small organic molecule
Emp. Form.:
C14H22N2O2
Mol. Mass.:
250.3367
SMILES:
CCN(C)C(=O)Oc1cccc(c1)[C@H](C)N(C)C
: