Target
5'-AMP-activated protein kinase catalytic subunit alpha-1
Ligand
BDBM50434272
Substrate
Meas. Tech.
ChEMBL_1617811 (CHEMBL3859880)
EC50
8000±n/a nM
Citation
 Cameron, KOKurumbail, RG Recent progress in the identification of adenosine monophosphate-activated protein kinase (AMPK) activators. Bioorg Med Chem Lett 26:5139-5148 (2016)  
Target
Name:
5'-AMP-activated protein kinase catalytic subunit alpha-1
Synonyms:
AAPK1_HUMAN AMP-activated protein kinase alpha-1/beta-2/gamma-2 AMPK subunit alpha-1 AMPK1 PRKAA1 | Tau-protein kinase PRKAA1
Type:
Protein
Mol. Mass.:
64023.62
Organism:
Homo sapiens (Human)
Description:
Q13131
Residue:
559
  
Inhibitor
Name:
BDBM50434272
Synonyms:
CHEMBL1242297
Type:
Small organic molecule
Emp. Form.:
C23H16ClN3O6S
Mol. Mass.:
497.908
SMILES:
Cc1cc(-c2ccc(\C=C3/S\C(NC3=O)=N/c3ccc(Cl)c(c3)C(O)=O)o2)c(cc1C)[N+]([O-])=O
: