Target
Excitatory amino acid transporter 3
Ligand
BDBM50093753
Substrate
Meas. Tech.
ChEMBL_1619057 (CHEMBL3861226)
IC50
3715±n/a nM
Citation
 Hansen, JCBjørn-Yoshimoto, WEBisballe, NNielsen, BJensen, AABunch, L ß-Sulfonamido Functionalized Aspartate Analogues as Excitatory Amino Acid Transporter Inhibitors: Distinct Subtype Selectivity Profiles Arising from Subtle Structural Differences. J Med Chem 59:8771-8786 (2016)  
Target
Name:
Excitatory amino acid transporter 3
Synonyms:
EAA3_HUMAN EAAT3 HEAAC1 | SLC1A1
Type:
Enzyme Catalytic Domain
Mol. Mass.:
57096.71
Organism:
Homo sapiens (Human)
Description:
Excitatory Amino Acid EAAT3 0 HUMAN::P43005
Residue:
524
  
Inhibitor
Name:
BDBM50093753
Synonyms:
(2S,3S)-2-Amino-3-benzyloxy-succinic acid (3S)-3-(BENZYLOXY)-L-ASPARTIC ACID DL-TBOA
Type:
Small organic molecule
Emp. Form.:
C11H13NO5
Mol. Mass.:
239.2246
SMILES:
N[C@@H]([C@H](OCc1ccccc1)C(O)=O)C(O)=O
: