Target
CDGSH iron-sulfur domain-containing protein 1
Ligand
BDBM57045
Substrate
Meas. Tech.
ChEMBL_1620948 (CHEMBL3863231)
Ki
816±n/a nM
Citation
 Geldenhuys, WJYonutas, HMMorris, DLSullivan, PGDarvesh, ASLeeper, TC Identification of small molecules that bind to the mitochondrial protein mitoNEET. Bioorg Med Chem Lett 26:5350-5353 (2016)  
Target
Name:
CDGSH iron-sulfur domain-containing protein 1
Synonyms:
C10orf70 CISD1_HUMAN ZCD1
Type:
PROTEIN
Mol. Mass.:
12206.48
Organism:
Homo sapiens (Human)
Description:
ChEMBL_766432
Residue:
108
  
Inhibitor
Name:
BDBM57045
Synonyms:
MLS000028500 SMR000058271 | cid_4509
Type:
Small organic molecule
Emp. Form.:
C8H6N4O5
Mol. Mass.:
238.157
SMILES:
[O-][N+](=O)c1ccc(\C=N\N2CC(=O)NC2=O)o1
: