Target
CDGSH iron-sulfur domain-containing protein 1
Ligand
BDBM50198768
Substrate
Meas. Tech.
ChEMBL_1620948 (CHEMBL3863231)
Ki
36±n/a nM
Citation
 Geldenhuys, WJYonutas, HMMorris, DLSullivan, PGDarvesh, ASLeeper, TC Identification of small molecules that bind to the mitochondrial protein mitoNEET. Bioorg Med Chem Lett 26:5350-5353 (2016)  
Target
Name:
CDGSH iron-sulfur domain-containing protein 1
Synonyms:
C10orf70 CISD1_HUMAN ZCD1
Type:
PROTEIN
Mol. Mass.:
12206.48
Organism:
Homo sapiens (Human)
Description:
ChEMBL_766432
Residue:
108
  
Inhibitor
Name:
BDBM50198768
Synonyms:
CHEMBL3890124
Type:
Small organic molecule
Emp. Form.:
C18H14ClNO4S
Mol. Mass.:
375.826
SMILES:
Clc1ccccc1OCCOc1ccc(\C=C2\SC(=O)NC2=O)cc1
: