Target
CDGSH iron-sulfur domain-containing protein 1
Ligand
BDBM50198775
Substrate
Meas. Tech.
ChEMBL_1620948 (CHEMBL3863231)
Ki
148±n/a nM
Citation
 Geldenhuys, WJYonutas, HMMorris, DLSullivan, PGDarvesh, ASLeeper, TC Identification of small molecules that bind to the mitochondrial protein mitoNEET. Bioorg Med Chem Lett 26:5350-5353 (2016)  
Target
Name:
CDGSH iron-sulfur domain-containing protein 1
Synonyms:
C10orf70 CISD1_HUMAN ZCD1
Type:
PROTEIN
Mol. Mass.:
12206.48
Organism:
Homo sapiens (Human)
Description:
ChEMBL_766432
Residue:
108
  
Inhibitor
Name:
BDBM50198775
Synonyms:
CHEMBL3945250
Type:
Small organic molecule
Emp. Form.:
C14H20N2
Mol. Mass.:
216.322
SMILES:
C1C(NC2CCNCC2)C1c1ccccc1
: