Target
5-hydroxytryptamine receptor 2C
Ligand
BDBM50206714
Substrate
Meas. Tech.
ChEMBL_1629223 (CHEMBL3871849)
EC50
1.6±n/a nM
Citation
 Schrader, TOKasem, MRen, AFeichtinger, KAl Doori, BWei, JWu, CDang, HLe, MGatlin, JChase, KDong, JWhelan, KTSage, CGrottick, AJSemple, G Tetrahydroquinoline-based tricyclic amines as potent and selective agonists of the 5-HT Bioorg Med Chem Lett 26:5877-5882 (2016)  
Target
Name:
5-hydroxytryptamine receptor 2C
Synonyms:
5-HT-2C 5-HT2C-INI 5-HTR2C 5-hydroxytryptamine receptor 2C (5-HT-2C) 5HT-1C HTR1C Serotonin (5-HT3) receptor Serotonin Receptor 2C
Type:
G Protein-Coupled Receptor (GPCR)
Mol. Mass.:
51836.79
Organism:
Homo sapiens (Human)
Description:
P28335
Residue:
458
  
Inhibitor
Name:
BDBM50206714
Synonyms:
CHEMBL3919795
Type:
Small organic molecule
Emp. Form.:
C19H22N2
Mol. Mass.:
278.3914
SMILES:
C(c1ccccc1)c1cccc2N3CCNCC3CCc12
: