Target
Platelet glycoprotein VI
Ligand
BDBM50211281
Substrate
Meas. Tech.
ChEMBL_1636318 (CHEMBL3879216)
Kd
850000±n/a nM
Citation
 Bhunia, SSMisra, AKhan, IAGaur, SJain, MSingh, SSaxena, AHohlfield, TDikshit, MSaxena, AK Novel Glycoprotein VI Antagonists as Antithrombotics: Synthesis, Biological Evaluation, and Molecular Modeling Studies on 2,3-Disubstituted Tetrahydropyrido(3,4-b)indoles. J Med Chem 60:322-337 (2017)  
Target
Name:
Platelet glycoprotein VI
Synonyms:
GP6 GPVI_HUMAN Platelet glycoprotein VI
Type:
PROTEIN
Mol. Mass.:
36878.67
Organism:
Homo sapiens (Human)
Description:
ChEMBL_109099
Residue:
339
  
Inhibitor
Name:
BDBM50211281
Synonyms:
CHEMBL3894250
Type:
Small organic molecule
Emp. Form.:
C23H22N4O
Mol. Mass.:
370.447
SMILES:
C(CCc1ccccc1)COc1ccc(cc1)-c1cccc(c1)-c1nnn[nH]1
: