Target
Beta-lactamase BRO-1
Ligand
BDBM50021959
Substrate
Meas. Tech.
ChEMBL_40225 (CHEMBL653998)
IC50
30.1±n/a nM
Citation
  TBA Bioorg Med Chem Lett 3:2247-2252 (1993)   
Target
Name:
Beta-lactamase BRO-1
Synonyms:
BLA1_MORCA Penicillinase | bla
Type:
PROTEIN
Mol. Mass.:
35383.81
Organism:
Moraxella catarrhalis
Description:
ChEMBL_104100
Residue:
313
  
Inhibitor
Name:
BDBM50021959
Synonyms:
CHEMBL777 US9120808, Clavulanic acid potassium salt clavulanic acid
Type:
Small organic molecule
Emp. Form.:
C8H9NO5
Mol. Mass.:
199.1608
SMILES:
OC\C=C1/O[C@@H]2CC(=O)N2[C@H]1C(O)=O
: