Target
Beta-lactamase
Ligand
BDBM50021954
Substrate
Meas. Tech.
ChEMBL_40257 (CHEMBL656487)
IC50
857±n/a nM
Citation
  TBA Bioorg Med Chem Lett 3:2247-2252 (1993)   
Target
Name:
Beta-lactamase
Synonyms:
AMPC_CITFR ampC | blaC
Type:
PROTEIN
Mol. Mass.:
41983.84
Organism:
Citrobacter freundii
Description:
ChEMBL_40254
Residue:
381
  
Inhibitor
Name:
BDBM50021954
Synonyms:
(2S,5R)-3,3-Dimethyl-4,4,7-trioxo-4lambda*6*-thia-1-aza-bicyclo[3.2.0]heptane-2-carboxylic acid 3,3-Dimethyl-4,4,7-trioxo-4lambda*6*-thia-1-aza-bicyclo[3.2.0]heptane-2-carboxylic acid CHEMBL403 SULBACTAM US20230322715, Compound ALK-09 | US9120808, Sulbactam sodium salt
Type:
Small organic molecule
Emp. Form.:
C8H11NO5S
Mol. Mass.:
233.242
SMILES:
CC1(C)[C@@H](N2[C@@H](CC2=O)S1(=O)=O)C(O)=O
: