Target
D(1A) dopamine receptor
Ligand
BDBM50130290
Substrate
Meas. Tech.
ChEMBL_58827 (CHEMBL671912)
Ki
1585±n/a nM
Citation
  TBA Bioorg Med Chem Lett 5:579-584 (1995)   
Target
Name:
D(1A) dopamine receptor
Synonyms:
DOPAMINE D1 Dopamine D1 high Dopamine receptor Dopamine1-like Drd1a
Type:
Enzyme Catalytic Domain
Mol. Mass.:
49429.75
Organism:
RAT
Description:
P18901
Residue:
446
  
Inhibitor
Name:
BDBM50130290
Synonyms:
3-Ethyl-2-methyl-5-morpholin-4-ylmethyl-1,5,6,7-tetrahydro-indol-4-one CHEMBL460 Moban
Type:
Small organic molecule
Emp. Form.:
C16H24N2O2
Mol. Mass.:
276.374
SMILES:
CCc1c(C)[nH]c2CCC(CN3CCOCC3)C(=O)c12
: