Target
5-hydroxytryptamine receptor 2A
Ligand
BDBM50130290
Substrate
Meas. Tech.
ChEMBL_2430 (CHEMBL617266)
Ki
1413±n/a nM
Citation
  TBA Bioorg Med Chem Lett 5:579-584 (1995)   
Target
Name:
5-hydroxytryptamine receptor 2A
Synonyms:
5-HT-2A 5-HT2A 5-hydroxytryptamine receptor 2A (5HT2A) Htr2 Serotonin Receptor 2A
Type:
G Protein-Coupled Receptor (GPCR)
Mol. Mass.:
52852.05
Organism:
Rattus norvegicus (rat)
Description:
Rat cortex membranes 5-HT2A receptors.
Residue:
471
  
Inhibitor
Name:
BDBM50130290
Synonyms:
3-Ethyl-2-methyl-5-morpholin-4-ylmethyl-1,5,6,7-tetrahydro-indol-4-one CHEMBL460 Moban
Type:
Small organic molecule
Emp. Form.:
C16H24N2O2
Mol. Mass.:
276.374
SMILES:
CCc1c(C)[nH]c2CCC(CN3CCOCC3)C(=O)c12
: