Target
Sporulation kinase A
Ligand
BDBM50215970
Substrate
Meas. Tech.
ChEMBL_87376 (CHEMBL694305)
IC50
98000±n/a nM
Citation
 Hlasta, DJDemers, JPFoleno, BDFraga-Spano, SAGuan, JHilliard, JJMacielag, MJOhemeng, KASheppard, CMSui, ZWebb, GCWeidner-Wells, MAWerblood, HBarrett, JF Novel inhibitors of bacterial two-component systems with gram positive antibacterial activity: pharmacophore identification based on the screening hit closantel. Bioorg Med Chem Lett 8:1923-8 (1998)  
Target
Name:
Sporulation kinase A
Synonyms:
KINA_BACSU Stage II sporulation protein F gsiC scoD spoIIJ
Type:
PROTEIN
Mol. Mass.:
69161.05
Organism:
Bacillus subtilis (strain 168)
Description:
ChEMBL_105028
Residue:
606
  
Inhibitor
Name:
BDBM50215970
Synonyms:
CHEMBL56781
Type:
Small organic molecule
Emp. Form.:
C13H7Cl4NO2
Mol. Mass.:
351.012
SMILES:
Oc1c(Cl)cc(cc1Cl)C(=O)Nc1ccc(Cl)c(Cl)c1
: