Target
Sporulation kinase A
Ligand
BDBM50218650
Substrate
Meas. Tech.
ChEMBL_92581 (CHEMBL700426)
IC50
88000±n/a nM
Citation
 Weidner-Wells, MAOhemeng, KANguyen, VNFraga-Spano, SMacielag, MJWerblood, HMFoleno, BDWebb, GCBarrett, JFHlasta, DJ Amidino benzimidazole inhibitors of bacterial two-component systems. Bioorg Med Chem Lett 11:1545-8 (2001)  
Target
Name:
Sporulation kinase A
Synonyms:
KINA_BACSU Stage II sporulation protein F gsiC scoD spoIIJ
Type:
PROTEIN
Mol. Mass.:
69161.05
Organism:
Bacillus subtilis (strain 168)
Description:
ChEMBL_105028
Residue:
606
  
Inhibitor
Name:
BDBM50218650
Synonyms:
CHEMBL2114423
Type:
Small organic molecule
Emp. Form.:
C20H16N4
Mol. Mass.:
312.3678
SMILES:
NC(=N)c1ccc2nc([nH]c2c1)-c1ccc(cc1)-c1ccccc1
: