Target
Sodium channel protein type 1/2/3 subunit alpha
Ligand
BDBM50004704
Substrate
Meas. Tech.
ChEMBL_202547 (CHEMBL806152)
IC50
45000±n/a nM
Citation
 McNeal, ETLewandowski, GADaly, JWCreveling, CR [3H]Batrachotoxinin A 20 alpha-benzoate binding to voltage-sensitive sodium channels: a rapid and quantitative assay for local anesthetic activity in a variety of drugs. J Med Chem 28:381-8 (1985)  
Target
Name:
Sodium channel protein type 1/2/3 subunit alpha
Synonyms:
Sodium channel alpha subunits; brain (Types I, II, III) | Sodium channel protein type I I alpha subunit
Type:
Mol. Mass.:
Description:
ASSAY_ID of EBI is 68595
Components:
This complex has 3 components.
Component 1
Name:
Sodium channel protein type 1 subunit alpha
Synonyms:
NAC1 SCN1A Sodium (Site 1) Sodium channel protein type 1 subunit alpha Sodium channel protein type I subunit alpha Voltage-gated sodium channel subunit alpha Nav1.1
Type:
Protein
Mol. Mass.:
228952.47
Organism:
Homo sapiens (Human)
Description:
P35498
Residue:
2009
  
Component 2
Name:
Sodium channel protein type 2 subunit alpha
Synonyms:
HBSC II SCN2A SCN2A2 Sodium (Site 2) Sodium channel protein type 2 alpha subunit Voltage-gated sodium channel subunit alpha Nav1.2
Type:
Enzyme
Mol. Mass.:
227954.68
Organism:
Homo sapiens (Human)
Description:
Q99250
Residue:
2005
  
Component 3
Name:
Sodium channel protein type 3 subunit alpha
Synonyms:
KIAA1356 NAC3 SCN3A_HUMAN Sodium channel alpha subunits; brain (Types I, II, III) Voltage-gated sodium channel subunit alpha Nav1.3 (Nav1.3)
Type:
Protein
Mol. Mass.:
226276.42
Organism:
Homo sapiens (Human)
Description:
Q9NY46
Residue:
2000
  
Inhibitor
Name:
BDBM50004704
Synonyms:
(+)-cis-Diltiazem 5-(2-dimethylamino-ethyl)-2-(4-methoxy-phenyl)-4-oxo-2,3,4,5-tetrahydro-benzo[b][1,4]thiazepin-3-yl ester(Diltiazem)Acetic acid Acetic acid (2S,3S)-5-(2-dimethylamino-ethyl)-2-(4-methoxy-phenyl)-4-oxo-2,3,4,5-tetrahydro-benzo[b][1,4]thiazepin-3-yl ester Acetic acid 5-(2-dimethylamino-ethyl)-2-(4-methoxy-phenyl)-4-oxo-2,3,4,5-tetrahydro-benzo[b][1,4]thiazepin-3-yl ester Acetic acid 5-(2-dimethylamino-ethyl)-2-(4-methoxy-phenyl)-4-oxo-2,3,4,5-tetrahydro-benzo[b][1,4]thiazepin-3-yl ester(cis-(+)-Diltiazem) CHEMBL23 DILTIAZEM Diltzac Tiamate cis-Acetic acid 5-(2-dimethylamino-ethyl)-2-(4-methoxy-phenyl)-4-oxo-2,3,4,5-tetrahydro-benzo[b][1,4]thiazepin-3-yl ester | diltiazem;Acetic acid 5-(2-dimethylamino-ethyl)-2-(4-methoxy-phenyl)-4-oxo-2,3,4,5-tetrahydro-benzo[b][1,4]thiazepin-3-yl ester
Type:
Small organic molecule
Emp. Form.:
C22H26N2O4S
Mol. Mass.:
414.518
SMILES:
COc1ccc(cc1)[C@@H]1Sc2ccccc2N(CCN(C)C)C(=O)[C@@H]1OC(C)=O
: