Target
Alcohol dehydrogenase S chain
Ligand
BDBM50226196
Substrate
Meas. Tech.
ChEMBL_30984 (CHEMBL645176)
Ki
64565±n/a nM
Citation
 Hansch, CKlein, TMcClarin, JLangridge, RCornell, NW A quantitative structure-activity relationship and molecular graphics analysis of hydrophobic effects in the interactions of inhibitors with alcohol dehydrogenase. J Med Chem 29:615-20 (1986)  
Target
Name:
Alcohol dehydrogenase S chain
Synonyms:
1.1.1.1 Alcohol dehydrogenase S chain
Type:
PROTEIN
Mol. Mass.:
39633.49
Organism:
Equus caballus
Description:
ChEMBL_105061
Residue:
374
  
Inhibitor
Name:
BDBM50226196
Synonyms:
CHEMBL160368
Type:
Small organic molecule
Emp. Form.:
C8H8FNO
Mol. Mass.:
153.1536
SMILES:
NC(=O)Cc1ccc(F)cc1
: