Target
Adenylate cyclase type 4
Ligand
BDBM50226414
Substrate
Meas. Tech.
ChEMBL_31440 (CHEMBL873058)
Ki
4.2±n/a nM
Citation
 Ali, FEChang, HLHuffman, WFHeckman, GKinter, LBWeidley, EFEdwards, RSchmidt, DAshton-Shue, DStassen, FL Potent vasopressin antagonists modified at the carboxy-terminal tripeptide tail. J Med Chem 30:2291-4 (1987)  
Target
Name:
Adenylate cyclase type 4
Synonyms:
4.6.1.1 ADCY4_HUMAN Adenylate cyclase type 4 Adenylyl cyclase 4
Type:
PROTEIN
Mol. Mass.:
119807.04
Organism:
Homo sapiens (Human)
Description:
ChEMBL_104878
Residue:
1077
  
Inhibitor
Name:
BDBM50226414
Synonyms:
CHEMBL2369778
Type:
Small organic molecule
Emp. Form.:
C57H87N13O10S2
Mol. Mass.:
1178.512
SMILES:
[#6]-[#6]-[#8]-c1ccc(-[#6]-[#6@H]-2-[#7]-[#6](=O)-[#6]C([#16]-[#16]-[#6]-[#6@H](-[#7]-[#6](=O)-[#6@H](-[#6]-[#6](-[#7])=O)-[#7]-[#6](=O)-[#6@@H](-[#7]-[#6](=O)-[#6@H](-[#6]-c3ccccc3)-[#7]-[#6]-2=O)-[#6](-[#6])-[#6])-[#6](=O)-[#7]-[#6@@H](-[#6]-[#6]-[#6]-[#6]-[#7])-[#6](=O)-[#7]-[#6@@H](-[#6]-[#6]-[#6]\[#7]=[#6](/[#7])-[#7])-[#6](-[#7])=O)([#6]-2-[#6]-[#6]-[#6]-[#6]-2)[#6]-2-[#6]-[#6]-[#6]-[#6]-2)cc1
: