Target
Muscarinic acetylcholine receptor M1/M2/M3/M4/M5
Ligand
BDBM50010859
Substrate
Meas. Tech.
ChEMBL_139459 (CHEMBL752167)
Ki
65±n/a nM
Citation
 Eberlein, WGTrummlitz, GEngel, WWSchmidt, GPelzer, HMayer, N Tricyclic compounds as selective antimuscarinics. 1. Structural requirements for selectivity toward the muscarinic acetylcholine receptor in a series of pirenzepine and imipramine analogues. J Med Chem 30:1378-82 (1987)  
Target
Name:
Muscarinic acetylcholine receptor M1/M2/M3/M4/M5
Synonyms:
Muscarinic acetylcholine receptor
Type:
Mol. Mass.:
Description:
ASSAY_ID of ChEMBL is 1821274
Components:
This complex has 5 components.
Component 1
Name:
Muscarinic acetylcholine receptor M1
Synonyms:
ACM1_RAT Chrm-1 cholinergic receptor, muscarinic 1
Type:
Enzyme Catalytic Domain
Mol. Mass.:
51390.46
Organism:
RAT
Description:
P08482
Residue:
460
  
Component 2
Name:
Muscarinic acetylcholine receptor M3
Synonyms:
ACM3_RAT Chrm-3 | Chrm3
Type:
Enzyme Catalytic Domain
Mol. Mass.:
66086.66
Organism:
RAT
Description:
Cholinergic, muscarinic M3 CHRM3 RAT::P08483
Residue:
589
  
Component 3
Name:
Muscarinic acetylcholine receptor M4
Synonyms:
ACM4_RAT Chrm-4 | Chrm4
Type:
Enzyme Catalytic Domain
Mol. Mass.:
52841.70
Organism:
RAT
Description:
Cholinergic, muscarinic M4 CHRM4 RAT::P08485
Residue:
477
  
Component 4
Name:
Muscarinic acetylcholine receptor M5
Synonyms:
ACM5_RAT Chrm-5 Muscarinic acetylcholine receptor | Muscarinic acetylcholine receptor M5
Type:
Enzyme Catalytic Domain
Mol. Mass.:
60161.80
Organism:
RAT
Description:
Cholinergic, muscarinic M5 CHRM5 RAT::P08911
Residue:
531
  
Component 5
Name:
Muscarinic acetylcholine receptor M2
Synonyms:
ACM2_RAT Chrm-2 | Chrm2
Type:
Enzyme Catalytic Domain
Mol. Mass.:
51555.53
Organism:
RAT
Description:
P10980
Residue:
466
  
Inhibitor
Name:
BDBM50010859
Synonyms:
CHEMBL11 IMIPRAMINE PAMOATE | Imipramin
Type:
Small organic molecule
Emp. Form.:
C19H24N2
Mol. Mass.:
280.4073
SMILES:
CN(C)CCCN1c2ccccc2CCc2ccccc12
: