Target
DNA topoisomerase 2-beta
Ligand
BDBM50045004
Substrate
Meas. Tech.
ChEMBL_75870 (CHEMBL687257)
IC50
2760±n/a nM
Citation
 Wentland, MPPerni, RBDorff, PHRake, JB Synthesis and bacterial DNA gyrase inhibitory properties of a spirocyclopropylquinolone derivative. J Med Chem 31:1694-7 (1988)  
Target
Name:
DNA topoisomerase 2-beta
Synonyms:
DNA topoisomerase II TOP2B | TOP2B_HUMAN
Type:
PROTEIN
Mol. Mass.:
183284.13
Organism:
Homo sapiens (Human)
Description:
ChEMBL_51583
Residue:
1626
  
Inhibitor
Name:
BDBM50045004
Synonyms:
9-fluoro-3-methyl-10-(4-methylpiperazin-1-yl)-7-oxo-2,3-dihydro-7H-[1,4]oxazino[2,3,4-ij]quinoline-6-carboxylic acid OFLOXACIN | OFLX
Type:
Small organic molecule
Emp. Form.:
C18H20FN3O4
Mol. Mass.:
361.3675
SMILES:
CC1COc2c(N3CCN(C)CC3)c(F)cc3c2n1cc(C(O)=O)c3=O
: