Target
Carbonic anhydrase 1
Ligand
BDBM50003677
Substrate
Meas. Tech.
ChEMBL_1643897 (CHEMBL3992826)
Ki
>50000±n/a nM
Citation
 van Kuijk, SJAParvathaneni, NKNiemans, Rvan Gisbergen, MWCarta, FVullo, DPastorekova, SYaromina, ASupuran, CTDubois, LJWinum, JYLambin, P New approach of delivering cytotoxic drugs towards CAIX expressing cells: A concept of dual-target drugs. Eur J Med Chem 127:691-702 (2017)  
Target
Name:
Carbonic anhydrase 1
Synonyms:
CA-I CAB Carbonate dehydratase I Carbonic anhydrase 1 (CA I) Carbonic anhydrase 1 (Recombinant CA I) Carbonic anhydrase B Carbonic anhydrase I (CA I) Carbonic anhydrase I (CAI) Carbonic anhydrase isoenzyme I (hCA I) | hCA
Type:
Enzyme
Mol. Mass.:
28873.37
Organism:
Homo sapiens (Human)
Description:
P00915
Residue:
261
  
Inhibitor
Name:
BDBM50003677
Synonyms:
4-(p-bis(beta-chloroethyl)aminophenyl)butyric acid 4-{4-[bis(2-chloroethyl)amino]phenyl}butanoic acid CHEMBL515 Leukeran chloraminophen phenylbutyric acid nitrogen mustard
Type:
Small organic molecule
Emp. Form.:
C14H19Cl2NO2
Mol. Mass.:
304.212
SMILES:
OC(=O)CCCc1ccc(cc1)N(CCCl)CCCl
: