Target
Proteasome subunit beta type-9
Ligand
BDBM50007203
Substrate
Meas. Tech.
ChEMBL_1648454 (CHEMBL3997510)
IC50
290±n/a nM
Citation
 Johnson, HWBAnderl, JLBradley, EKBui, JJones, JArastu-Kapur, SKelly, LMLowe, EMoebius, DCMuchamuel, TKirk, CWang, ZMcMinn, D Discovery of Highly Selective Inhibitors of the Immunoproteasome Low Molecular Mass Polypeptide 2 (LMP2) Subunit. ACS Med Chem Lett 8:413-417 (2017)  
Target
Name:
Proteasome subunit beta type-9
Synonyms:
LMP2 Macropain chain 7 PSB9_HUMAN PSMB9 Proteasome subunit beta-1i Really interesting new gene 12 protein
Type:
PROTEIN
Mol. Mass.:
23256.49
Organism:
Homo sapiens (Human)
Description:
ChEMBL_106197
Residue:
219
  
Inhibitor
Name:
BDBM50007203
Synonyms:
CHEMBL3237875
Type:
Small organic molecule
Emp. Form.:
C31H40N4O7
Mol. Mass.:
580.6719
SMILES:
COc1ccc(C[C@H](NC(=O)[C@H](C)NC(=O)CN2CCOCC2)C(=O)N[C@@H](Cc2ccccc2)C(=O)[C@@]2(C)CO2)cc1
: