Target
Fibroblast growth factor receptor 2
Ligand
BDBM50232831
Substrate
Meas. Tech.
ChEMBL_1649224 (CHEMBL3998358)
IC50
1230±n/a nM
Citation
 Cheng, WWang, MTian, XZhang, X An overview of the binding models of FGFR tyrosine kinases in complex with small molecule inhibitors. Eur J Med Chem 126:476-490 (2017)  
Target
Name:
Fibroblast growth factor receptor 2
Synonyms:
BEK FGFR-2 FGFR2 Fibroblast growth factor receptor 2 (FGFR2) KGFR Keratinocyte growth factor receptor VEGF-receptor 2 and Fibroblast growth factor receptor 2
Type:
Enzyme
Mol. Mass.:
92015.45
Organism:
Homo sapiens (Human)
Description:
P21802
Residue:
821
  
Inhibitor
Name:
BDBM50232831
Synonyms:
CHEMBL1738735
Type:
Small organic molecule
Emp. Form.:
C18H15N3
Mol. Mass.:
273.3318
SMILES:
Nc1ncc2C[C@@H](c3ccccc3)c3ccccc3-c2n1
: