Target
Tyrosyl-DNA phosphodiesterase 1
Ligand
BDBM50232847
Substrate
Meas. Tech.
ChEMBL_1649249 (CHEMBL3998383)
IC50
190±n/a nM
Citation
 Zakharenko, ALuzina, OKoval, ONilov, DGushchina, IDyrkheeva, N?vedas, VSalakhutdinov, NLavrik, O Tyrosyl-DNA Phosphodiesterase 1 Inhibitors: Usnic Acid Enamines Enhance the Cytotoxic Effect of Camptothecin. J Nat Prod 79:2961-2967 (2016)  
Target
Name:
Tyrosyl-DNA phosphodiesterase 1
Synonyms:
TDP1 Tyrosyl-DNA phosphodiesterase 1 | Tyrosyl-DNA phosphodiesterase 1 (TDP1)
Type:
Enzyme
Mol. Mass.:
68430.66
Organism:
Homo sapiens (Human)
Description:
Q9NUW8
Residue:
608
  
Inhibitor
Name:
BDBM50232847
Synonyms:
CHEMBL4090202
Type:
Small organic molecule
Emp. Form.:
C34H41NO7
Mol. Mass.:
575.6918
SMILES:
CC(=O)c1c2OC3=CC(=O)\C(=C(\C)NCCc4cc(c(O)c(c4)C(C)(C)C)C(C)(C)C)C(=O)C3(C)c2c(O)c(C)c1O
: