Target
Cytochrome P450 2C19
Ligand
BDBM45440
Substrate
Meas. Tech.
ChEMBL_1649456 (CHEMBL3998590)
IC50
>100000±n/a nM
Target
Name:
Cytochrome P450 2C19
Synonyms:
CP2CJ_HUMAN CYPIIC17 Cytochrome P450 2C19 (CYP2C19) Mephenytoin 4-hydroxylase P450-254C
Type:
Enzyme
Mol. Mass.:
55935.47
Organism:
Homo sapiens (Human)
Description:
P33261
Residue:
490
  
Inhibitor
Name:
BDBM45440
Synonyms:
4-[5-(4-amidinophenoxy)pentoxy]benzamidine;2-hydroxyethanesulfonic acid 4-[5-(4-carbamimidoylphenoxy)pentoxy]benzenecarboximidamide;2-oxidanylethanesulfonic acid MLS000028738 PENTAMIDINE ISETHIONATE cid_359323
Type:
Small organic molecule
Emp. Form.:
C19H24N4O2
Mol. Mass.:
340.4195
SMILES:
NC(=N)c1ccc(OCCCCCOc2ccc(cc2)C(N)=N)cc1
: