Target
Prostaglandin G/H synthase 2
Ligand
BDBM85511
Substrate
Meas. Tech.
ChEMBL_1653561 (CHEMBL4002927)
IC50
140±n/a nM
Citation
 Nguyen, BCQTakahashi, HUto, YShahinozzaman, MDTawata, SMaruta, H 1,2,3-Triazolyl ester of Ketorolac: A"Click Chemistry"-based highly potent PAK1-blocking cancer-killer. Eur J Med Chem 126:270-276 (2017)  
Target
Name:
Prostaglandin G/H synthase 2
Synonyms:
COX2 Cyclooxygenase 2 (COX-2) Cyclooxygenase-2 (COX-2 AA) Cyclooxygenase-2 (COX-2) PGH2_HUMAN PHS II Prostaglandin E synthase/G/H synthase 2 Prostaglandin-endoperoxide synthase 2
Type:
Enzyme
Mol. Mass.:
69003.89
Organism:
Homo sapiens (Human)
Description:
Recombinant Cox-2 provided by Cayman (Cayman Chemical Co.,Ann Arbor, MI).
Residue:
604
  
Inhibitor
Name:
BDBM85511
Synonyms:
CAS_74103-07-4 Ketorolac tris salt | Toradol
Type:
Small organic molecule
Emp. Form.:
C15H13NO3
Mol. Mass.:
255.2686
SMILES:
OC(=O)C1CCn2c1ccc2C(=O)c1ccccc1
: