Target
Sodium/glucose cotransporter 2
Ligand
BDBM23446
Substrate
Meas. Tech.
ChEMBL_1654734 (CHEMBL4004100)
IC50
18300±n/a nM
Citation
 Jesus, ARVila-Viçosa, DMachuqueiro, MMarques, APDore, TMRauter, AP Targeting Type 2 Diabetes with C-Glucosyl Dihydrochalcones as Selective Sodium Glucose Co-Transporter 2 (SGLT2) Inhibitors: Synthesis and Biological Evaluation. J Med Chem 60:568-579 (2017)  
Target
Name:
Sodium/glucose cotransporter 2
Synonyms:
Na(+)/glucose cotransporter 2 SGLT2 Sodium-Dependent Glucose Cotransporter 2 (SGLT2) Solute carrier family 5 member 2
Type:
Protein
Mol. Mass.:
72902.00
Organism:
Homo sapiens (Human)
Description:
P31639
Residue:
672
  
Inhibitor
Name:
BDBM23446
Synonyms:
3-(4-hydroxyphenyl)-1-(2,4,6-trihydroxyphenyl)propan-1-one Phloretin | cid_4788
Type:
Dihydrochalcone
Emp. Form.:
C15H14O5
Mol. Mass.:
274.2687
SMILES:
Oc1ccc(CCC(=O)c2c(O)cc(O)cc2O)cc1
: