Target
Acetylcholinesterase
Ligand
BDBM50235322
Substrate
Meas. Tech.
ChEMBL_1655445 (CHEMBL4004915)
IC50
0.070000±n/a nM
Citation
 Sameem, BSaeedi, MMahdavi, MShafiee, A A review on tacrine-based scaffolds as multi-target drugs (MTDLs) for Alzheimer's disease. Eur J Med Chem 128:332-345 (2017)  
Target
Name:
Acetylcholinesterase
Synonyms:
ACES_RAT Acetylcholinesterase and butyrylcholinesterase (AChE and BChE) Acetylcholinesterase, AChE | Ache
Type:
Enzyme
Mol. Mass.:
68193.62
Organism:
Rattus norvegicus (rat)
Description:
P37136
Residue:
614
  
Inhibitor
Name:
BDBM50235322
Synonyms:
CHEMBL4066593
Type:
Small organic molecule
Emp. Form.:
C34H41ClN4
Mol. Mass.:
541.169
SMILES:
Clc1ccc2c(NCCCCCCCCNc3c4CCCCc4nc4ccccc34)c3CCCCc3nc2c1
: