Target
Uridine diphosphate glucose pyrophosphatase NUDT14
Ligand
BDBM50236118
Substrate
Meas. Tech.
ChEMBL_1658776 (CHEMBL4008388)
IC50
>100000±n/a nM
Citation
 Llona-Minguez, SHöglund, AWiita, EAlmlöf, IMateus, ACalderón-Montaño, JMCazares-Körner, CHoman, ELoseva, OBaranczewski, PJemth, ASHäggblad, MMartens, ULundgren, BArtursson, PLundbäck, TJenmalm Jensen, AWarpman Berglund, UScobie, MHelleday, T Identification of Triazolothiadiazoles as Potent Inhibitors of the dCTP Pyrophosphatase 1. J Med Chem 60:2148-2154 (2017)  
Target
Name:
Uridine diphosphate glucose pyrophosphatase NUDT14
Synonyms:
3.6.1.45 NUDT14 Nudix motif 14 UGPP Uridine diphosphate glucose pyrophosphatase
Type:
PROTEIN
Mol. Mass.:
24110.93
Organism:
Homo sapiens (Human)
Description:
ChEMBL_117548
Residue:
222
  
Inhibitor
Name:
BDBM50236118
Synonyms:
CHEMBL4065181
Type:
Small organic molecule
Emp. Form.:
C15H12N4O2S2
Mol. Mass.:
344.411
SMILES:
COc1ccc(cc1OC)-c1nn2c(nnc2s1)-c1cccs1
: