Target
Serine/threonine-protein kinase mTOR
Ligand
BDBM50348452
Substrate
Meas. Tech.
ChEMBL_1660181 (CHEMBL4009793)
IC50
4±n/a nM
Citation
 Mao, BGao, SWeng, YZhang, LZhang, L Design, synthesis, and biological evaluation of imidazo[1,2-b]pyridazine derivatives as mTOR inhibitors. Eur J Med Chem 129:135-150 (2017)  
Target
Name:
Serine/threonine-protein kinase mTOR
Synonyms:
FK506-binding protein 12-rapamycin complex-associated protein 1 FRAP FRAP1 MTOR Mammalian Target of Rapamycin (mTOR) RAFT1 Rapamycin and FKBP12 target 1 Serine/threonine-protein kinase (mTOR) | mTORC2
Type:
Rapamycin target protein
Mol. Mass.:
288917.12
Organism:
Homo sapiens (Human)
Description:
P42345
Residue:
2549
  
Inhibitor
Name:
BDBM50348452
Synonyms:
AZD-8055 US9102670, 1a
Type:
Small organic molecule
Emp. Form.:
C25H31N5O4
Mol. Mass.:
465.5447
SMILES:
COc1ccc(cc1CO)-c1ccc2c(nc(nc2n1)N1CCOC[C@@H]1C)N1CCOC[C@@H]1C
: