Target
A disintegrin and metalloproteinase with thrombospondin motifs 5
Ligand
BDBM194638
Substrate
Meas. Tech.
ChEMBL_1663584 (CHEMBL4013265)
IC50
1.000000±n/a nM
Citation
 Durham, TBMarimuthu, JToth, JLLiu, CAdams, LMudra, DRSwearingen, CLin, CChambers, MGThirunavukkarasu, KWiley, MR A Highly Selective Hydantoin Inhibitor of Aggrecanase-1 and Aggrecanase-2 with a Low Projected Human Dose. J Med Chem 60:5933-5939 (2017)  
Target
Name:
A disintegrin and metalloproteinase with thrombospondin motifs 5
Synonyms:
A disintegrin and metalloproteinase with thrombospondin motifs 5 (ADAMTS-5) ADAMTS5 ATS5_HUMAN Metalloproteinase with thrombospondin motifs 5 (ADAMTS-5)
Type:
Enzyme
Mol. Mass.:
101769.09
Organism:
Homo sapiens (Human)
Description:
Q9UNA0
Residue:
930
  
Inhibitor
Name:
BDBM194638
Synonyms:
US9206139, 1
Type:
Small organic molecule
Emp. Form.:
C18H20F3N3O3
Mol. Mass.:
383.3649
SMILES:
C[C@H](Cc1ccc(cc1)C(F)(F)F)C(=O)NC[C@]1(NC(=O)NC1=O)C1CC1
: