Target
Adenosine receptor A1
Ligand
BDBM21220
Substrate
Meas. Tech.
ChEBML_1663190
Ki
4.6±n/a nM
Citation
 Falsini, MSquarcialupi, LCatarzi, DVarano, FBetti, MDal Ben, DMarucci, GBuccioni, MVolpini, RDe Vita, TCavalli, AColotta, V The 1,2,4-Triazolo[4,3-a]pyrazin-3-one as a Versatile Scaffold for the Design of Potent Adenosine Human Receptor Antagonists. Structural Investigations to Target the A J Med Chem 60:5772-5790 (2017)  
Target
Name:
Adenosine receptor A1
Synonyms:
A1 adenosine receptor (hA1) AA1R_HUMAN ADORA1 Adenosine A1-receptor Adenosine receptor A1 (hA1) | Adenosine transporter (AdT)
Type:
G Protein-Coupled Receptor (GPCR)
Mol. Mass.:
36520.92
Organism:
Homo sapiens (Human)
Description:
P30542
Residue:
326
  
Inhibitor
Name:
BDBM21220
Synonyms:
(2S,3S,4R,5R)-5-(6-amino-9H-purin-9-yl)-N-ethyl-3,4-dihydroxyoxolane-2-carboxamide Adenosine, N6-Ethyl-carboxamido CHEMBL464859 NECA
Type:
Antineoplastic Agent
Emp. Form.:
C12H16N6O4
Mol. Mass.:
308.2932
SMILES:
CCNC(=O)[C@H]1O[C@H]([C@H](O)[C@@H]1O)n1cnc2c(N)ncnc12
: