Target
Myeloperoxidase
Ligand
BDBM81461
Substrate
Meas. Tech.
ChEMBL_1664239 (CHEMBL4013920)
IC50
2360±n/a nM
Citation
 Soubhye, JChikh Alard, IAldib, IPrévost, MGelbcke, MDe Carvalho, AFurtmüller, PGObinger, CFlemmig, JTadrent, SMeyer, FRousseau, ANève, JMathieu, VZouaoui Boudjeltia, KDufrasne, FVan Antwerpen, P Discovery of Novel Potent Reversible and Irreversible Myeloperoxidase Inhibitors Using Virtual Screening Procedure. J Med Chem 60:6563-6586 (2017)  
Target
Name:
Myeloperoxidase
Synonyms:
84 kDa myeloperoxidase MPO Myeloperoxidase Myeloperoxidase heavy chain PERM_HUMAN
Type:
Enzyme
Mol. Mass.:
83888.32
Organism:
Homo sapiens (Human)
Description:
P05164
Residue:
745
  
Inhibitor
Name:
BDBM81461
Synonyms:
CAS_86-54-4 Hydralazine (HZN) | NSC_3637
Type:
Small organic molecule
Emp. Form.:
C8H8N4
Mol. Mass.:
160.1759
SMILES:
NNc1nncc2ccccc12
: