Target
Alpha-mannosidase 2
Ligand
BDBM84869
Substrate
Meas. Tech.
Inhibition Assay
pH
5.75±0
Temperature
298.15±0 K
Ki
2.7±0.0 nM
IC50
29±0.0 nM
Citation
 Kuntz, DANakayama, SShea, KHori, HUto, YNagasawa, HRose, DR Structural investigation of the binding of 5-substituted swainsonine analogues to Golgi alpha-mannosidase II. Chembiochem 11:673-80 (2010)  
Target
Name:
Alpha-mannosidase 2
Synonyms:
Alpha-mannosidase 2 Golgi alpha-mannosidase II alpha-Man-IIa
Type:
Protein
Mol. Mass.:
126735.79
Organism:
Drosophila melanogaster (Fruit fly)
Description:
Q24451
Residue:
1108
  
Inhibitor
Name:
BDBM84869
Synonyms:
Swainsonine derivative, 4
Type:
Small organic molecule
Emp. Form.:
C20H29NO4
Mol. Mass.:
347.4486
SMILES:
CC(C)(C)c1ccc(cc1)C(=O)C[C@H]1CC[C@@H](O)C2[C@H](O)[C@H](O)CN12
: