Target
5-hydroxytryptamine receptor 2A
Ligand
BDBM84930
Substrate
Ki
33.1±n/a nM
Comments
PDSP_1151
Citation
 Nelson, DLLucaites, VLAudia, JENissen, JSWainscott, DB Species differences in the pharmacology of the 5-hydroxytryptamine2 receptor: structurally specific differentiation by ergolines and tryptamines. J Pharmacol Exp Ther 265:1272-9 (1993) Target
Name:
5-hydroxytryptamine receptor 2A
Synonyms:
5-HT2 HTR2A
Type:
Enzyme Catalytic Domain
Mol. Mass.:
52607.65
Organism:
Monkey
Description:
5-HT2 0 Monkey::P50128
Residue:
471
  
Inhibitor
Name:
BDBM84930
Synonyms:
CAS_60634-51-7 NSC_107989
Type:
Small organic molecule
Emp. Form.:
C23H32N2O3
Mol. Mass.:
384.5118
SMILES:
CC(O)C(C)OC(=O)C1CC2C(Cc3cn(C(C)C)c4cccc2c34)N(C)C1
: