Target
Alkaline phosphatase, tissue-nonspecific isozyme
Ligand
BDBM275100
Substrate
Meas. Tech.
TNAP Inhibition Activity
Temperature
298.15±n/a K
IC50
0.600±n/a nM
Comments
extracted
Citation
 Miyazaki, SYamamoto, YSuzuki, KInui, MIzumi, MSoma, KPinkerton, AShinozaki, T Pyridine compounds US Patent  US9879032 Publication Date 1/30/2018 
Target
Name:
Alkaline phosphatase, tissue-nonspecific isozyme
Synonyms:
ALPL tissue-nonspecific alkaline phosphatase precursor
Type:
PROTEIN
Mol. Mass.:
57306.17
Organism:
Homo sapiens (Human)
Description:
ChEMBL_1448917
Residue:
524
  
Inhibitor
Name:
BDBM275100
Synonyms:
US10221195, Example 42 | US9879032, Example 42
Type:
Small organic molecule
Emp. Form.:
C18H18FN3O5S
Mol. Mass.:
407.416
SMILES:
CCOc1ccc(F)cc1S(=O)(=O)Nc1cnc2OCC3(CC3)NC(=O)c2c1
: