Target
Sodium-dependent serotonin transporter
Ligand
BDBM50176062
Substrate
Ki
19.6±n/a nM
Comments
PDSP_1542
Citation
 Tatsumi, MGroshan, KBlakely, RDRichelson, E Pharmacological profile of antidepressants and related compounds at human monoamine transporters. Eur J Pharmacol 340:249-58 (1997)  
Target
Name:
Sodium-dependent serotonin transporter
Synonyms:
5-HT Transporter 5HTT SC6A4_HUMAN SLC6A4 Serotonin transporter (5HTT) Sodium-dependent serotonin transporter (SERT) | Solute carrier family 6 member 4
Type:
Multi-pass membrane protein
Mol. Mass.:
70322.51
Organism:
Homo sapiens (Human)
Description:
P31645
Residue:
630
  
Inhibitor
Name:
BDBM50176062
Synonyms:
3-(5H-dibenzo[a,d][7]annulen-5-yl)-N-methylpropan-1-amine 5-(3-methylaminopropyl)-5H-dibenzo[a,d]cycloheptene CHEMBL668 N-methyl-5H-dibenzo[a,d]cycloheptene-5-propylamine amimetilina
Type:
Small organic molecule
Emp. Form.:
C19H21N
Mol. Mass.:
263.3767
SMILES:
CNCCCC1c2ccccc2C=Cc2ccccc12
: