Target
Sodium-dependent noradrenaline transporter
Ligand
BDBM85218
Substrate
Ki
4.9±n/a nM
Comments
PDSP_6529
Citation
 Tatsumi, MGroshan, KBlakely, RDRichelson, E Pharmacological profile of antidepressants and related compounds at human monoamine transporters. Eur J Pharmacol 340:249-58 (1997)  
Target
Name:
Sodium-dependent noradrenaline transporter
Synonyms:
Monoamine transporter NET Noradrenaline Transporter (NET) Norepinephrine transporter protein (NET) SLC6A2 Sodium-dependent noradrenaline transporter (NET) | Solute carrier family 6 member 2
Type:
Multi-pass membrane protein
Mol. Mass.:
69337.72
Organism:
Homo sapiens (Human)
Description:
P23975
Residue:
617
  
Inhibitor
Name:
BDBM85218
Synonyms:
CAS_39022-39-4 | Oxaprotiline
Type:
Small organic molecule
Emp. Form.:
C20H23NO
Mol. Mass.:
293.4027
SMILES:
CNCC(O)CC12CCC(c3ccccc13)c1ccccc21
: