Target
D(3) dopamine receptor
Ligand
BDBM50002338
Substrate
Ki
1.5±n/a nM
Comments
PDSP_1849
Citation
 Seeman, PTallerico, T Antipsychotic drugs which elicit little or no parkinsonism bind more loosely than dopamine to brain D2 receptors, yet occupy high levels of these receptors. Mol Psychiatry 3:123-34 (1998)  
Target
Name:
D(3) dopamine receptor
Synonyms:
DOPAMINE D3 DRD3_HUMAN Dopamine D3 receptor (D3) Dopamine receptor Dopamine receptor D3
Type:
Mol. Mass.:
44243.43
Organism:
Homo sapiens (Human)
Description:
Residue:
400
  
Inhibitor
Name:
BDBM50002338
Synonyms:
(Thioridazine)10-[2-(1-Methyl-piperidin-2-yl)-ethyl]-2-methylsulfanyl-10H-phenothiazine 10-[2-(1-Methyl-piperidin-2-yl)-ethyl]-2-methylsulfanyl-10H-phenothiazine CHEMBL479 MELLARIL-S TP-21 | US9504692, Thioridazine
Type:
Small organic molecule
Emp. Form.:
C21H26N2S2
Mol. Mass.:
370.575
SMILES:
CSc1ccc2Sc3ccccc3N(CCC3CCCCN3C)c2c1
: