Target
Alpha-2A adrenergic receptor
Ligand
BDBM50159249
Substrate
Ki
7.76±n/a nM
Comments
PDSP_5979
Citation
 Jasper, JRLesnick, JDChang, LKYamanishi, SSChang, TKHsu, SADaunt, DABonhaus, DWEglen, RM Ligand efficacy and potency at recombinant alpha2 adrenergic receptors: agonist-mediated [35S]GTPgammaS binding. Biochem Pharmacol 55:1035-43 (1998)  
Target
Name:
Alpha-2A adrenergic receptor
Synonyms:
ADRA2A adrenergic Alpha2A
Type:
Enzyme Catalytic Domain
Mol. Mass.:
48888.08
Organism:
MOUSE
Description:
adrenergic Alpha2A ADRA2A MOUSE::Q01338
Residue:
450
  
Inhibitor
Name:
BDBM50159249
Synonyms:
CHEMBL16293 Naphthalin naftalina naphtaline | naphthalene
Type:
Small organic molecule
Emp. Form.:
C10H8
Mol. Mass.:
128.1705
SMILES:
c1ccc2ccccc2c1
: