Target
Alpha-2A adrenergic receptor
Ligand
BDBM34572
Substrate
Ki
43.65±n/a nM
Comments
PDSP_1943
Citation
 Jasper, JRLesnick, JDChang, LKYamanishi, SSChang, TKHsu, SADaunt, DABonhaus, DWEglen, RM Ligand efficacy and potency at recombinant alpha2 adrenergic receptors: agonist-mediated [35S]GTPgammaS binding. Biochem Pharmacol 55:1035-43 (1998)  
Target
Name:
Alpha-2A adrenergic receptor
Synonyms:
ADRA2A adrenergic Alpha2A
Type:
Enzyme Catalytic Domain
Mol. Mass.:
48888.08
Organism:
MOUSE
Description:
adrenergic Alpha2A ADRA2A MOUSE::Q01338
Residue:
450
  
Inhibitor
Name:
BDBM34572
Synonyms:
BRIMONIDINE MLS000069370 UK 14,304 | cid_2435
Type:
Small organic molecule
Emp. Form.:
C11H10BrN5
Mol. Mass.:
292.135
SMILES:
Brc1c(NC2=NCCN2)ccc2nccnc12
: