Target
Alpha-2C adrenergic receptor
Ligand
BDBM50027502
Substrate
Ki
2884.03±n/a nM
Comments
PDSP_2770
Citation
 Jasper, JRLesnick, JDChang, LKYamanishi, SSChang, TKHsu, SADaunt, DABonhaus, DWEglen, RM Ligand efficacy and potency at recombinant alpha2 adrenergic receptors: agonist-mediated [35S]GTPgammaS binding. Biochem Pharmacol 55:1035-43 (1998)  
Target
Name:
Alpha-2C adrenergic receptor
Synonyms:
ADA2C_HUMAN ADRA2L2 Adrenergic alpha2C Adrenergic receptor alpha Alpha-2 adrenergic receptor subtype C4 Alpha-2C adrenoreceptor | adrenergic, alpha-2C-, receptor [Homo sapiens]
Type:
Enzyme
Mol. Mass.:
49552.32
Organism:
Homo sapiens (Human)
Description:
P18825
Residue:
462
  
Inhibitor
Name:
BDBM50027502
Synonyms:
4-(2-Amino-1-hydroxy-propyl)-benzene-1,2-diol Aldoclor-250 METHYLNORADRENALINE alpha-Methyl-(+/-)norepinephrine,(+/-) | alpha-Methyl-(-)norepinephrine,(+/-)
Type:
Small organic molecule
Emp. Form.:
C9H13NO3
Mol. Mass.:
183.2044
SMILES:
CC(N)C(O)c1ccc(O)c(O)c1
: