Target
Prostaglandin G/H synthase 2
Ligand
BDBM85245
Substrate
Ki
2110±n/a nM
Comments
PDSP_3991
Citation
 Cryer, BFeldman, M Cyclooxygenase-1 and cyclooxygenase-2 selectivity of widely used nonsteroidal anti-inflammatory drugs. Am J Med 104:413-21 (1998)  
Target
Name:
Prostaglandin G/H synthase 2
Synonyms:
COX2 Cyclooxygenase 2 (COX-2) Cyclooxygenase-2 (COX-2 AA) Cyclooxygenase-2 (COX-2) PGH2_HUMAN PHS II Prostaglandin E synthase/G/H synthase 2 Prostaglandin-endoperoxide synthase 2
Type:
Enzyme
Mol. Mass.:
69003.89
Organism:
Homo sapiens (Human)
Description:
Recombinant Cox-2 provided by Cayman (Cayman Chemical Co.,Ann Arbor, MI).
Residue:
604
  
Inhibitor
Name:
BDBM85245
Synonyms:
CAS_36322-90-4 Piroxicam
Type:
Small organic molecule
Emp. Form.:
C15H13N3O4S
Mol. Mass.:
331.346
SMILES:
CN1C(C(=O)Nc2ccccn2)=C(O)c2ccccc2S1(=O)=O
: