Target
Prostaglandin G/H synthase 2
Ligand
BDBM26193
Substrate
Ki
>10000±n/a nM
Comments
PDSP_4489
Citation
 Cryer, BFeldman, M Cyclooxygenase-1 and cyclooxygenase-2 selectivity of widely used nonsteroidal anti-inflammatory drugs. Am J Med 104:413-21 (1998)  
Target
Name:
Prostaglandin G/H synthase 2
Synonyms:
COX2 Cyclooxygenase 2 (COX-2) Cyclooxygenase-2 (COX-2 AA) Cyclooxygenase-2 (COX-2) PGH2_HUMAN PHS II Prostaglandin E synthase/G/H synthase 2 Prostaglandin-endoperoxide synthase 2
Type:
Enzyme
Mol. Mass.:
69003.89
Organism:
Homo sapiens (Human)
Description:
Recombinant Cox-2 provided by Cayman (Cayman Chemical Co.,Ann Arbor, MI).
Residue:
604
  
Inhibitor
Name:
BDBM26193
Synonyms:
2-Hydroxybenzoate, I CHEMBL424 salicylic acid
Type:
Small organic molecule
Emp. Form.:
C7H6O3
Mol. Mass.:
138.1207
SMILES:
OC(=O)c1ccccc1O
: