Target
Alpha-1B adrenergic receptor
Ligand
BDBM81444
Substrate
Ki
2.00±n/a nM
Comments
PDSP_1955
Citation
 Wikberg-Matsson, AWikberg, JEUhlén, S Characterization of alpha1-adrenoceptor subtypes in the pig. Eur J Pharmacol 347:301-9 (1998)  
Target
Name:
Alpha-1B adrenergic receptor
Synonyms:
ADRA1B | adrenergic Alpha1B
Type:
Enzyme Catalytic Domain
Mol. Mass.:
34826.67
Organism:
PIG
Description:
Q70HQ0
Residue:
316
  
Inhibitor
Name:
BDBM81444
Synonyms:
CAS_185453 WB 4101 | WB-4101
Type:
Small organic molecule
Emp. Form.:
C25H27NO5
Mol. Mass.:
421.4856
SMILES:
COc1cccc(OC)c1OCCNCC1Oc2ccccc2OC1c1ccccc1
: